Reaction Details
TargetAcetylcholinesterase
LigandBDBM50435286
Substrate/Competitorn/a
Meas. Tech.ChEMBL_963636 (CHEMBL2395155)
IC50 20±n/a nM
Citation Eckroat, TJGreen, KDReed, RABornstein, JJGarneau-Tsodikova, S Investigation of the role of linker moieties in bifunctional tacrine hybrids. Bioorg Med Chem21:3614-23 (2013) 
 
Acetylcholinesterase
Name:Acetylcholinesterase
Type:Enzyme
Mol. Mass.:71812.79
Organism:Electrophorus electricus (Electric eel)
Description:n/a
Residue:633
BDBM50435286
NameBDBM50435286
Synonyms:CHEMBL2393100
TypeSmall organic molecule
Emp. Form.C21H29ClN2
Mol. Mass.344.921
SMILESCCCCCCCCNc1c2CCCCc2nc2cc(Cl)ccc12