Reaction Details
TargetAcetylcholinesterase
LigandBDBM50435292
Substrate/Competitorn/a
Meas. Tech.ChEMBL_963636 (CHEMBL2395155)
IC50 1.1±n/a nM
Citation Eckroat, TJGreen, KDReed, RABornstein, JJGarneau-Tsodikova, S Investigation of the role of linker moieties in bifunctional tacrine hybrids. Bioorg Med Chem21:3614-23 (2013) 
 
Acetylcholinesterase
Name:Acetylcholinesterase
Type:Enzyme
Mol. Mass.:71812.79
Organism:Electrophorus electricus (Electric eel)
Description:n/a
Residue:633
BDBM50435292
NameBDBM50435292
Synonyms:CHEMBL2393094
TypeSmall organic molecule
Emp. Form.C21H30ClN3
Mol. Mass.359.936
SMILESNCCCCCCCCNc1c2CCCCc2nc2cc(Cl)ccc12