Reaction Details
TargetAcetylcholinesterase
LigandBDBM50435293
Substrate/Competitorn/a
Meas. Tech.ChEMBL_963636 (CHEMBL2395155)
IC50 5.4±n/a nM
Citation Eckroat, TJGreen, KDReed, RABornstein, JJGarneau-Tsodikova, S Investigation of the role of linker moieties in bifunctional tacrine hybrids. Bioorg Med Chem21:3614-23 (2013) 
 
Acetylcholinesterase
Name:Acetylcholinesterase
Type:Enzyme
Mol. Mass.:71812.79
Organism:Electrophorus electricus (Electric eel)
Description:n/a
Residue:633
BDBM50435293
NameBDBM50435293
Synonyms:CHEMBL2393093
TypeSmall organic molecule
Emp. Form.C20H28ClN3
Mol. Mass.345.909
SMILESNCCCCCCCNc1c2CCCCc2nc2cc(Cl)ccc12