Reaction Details
TargetAcetylcholinesterase
LigandBDBM50435296
Substrate/Competitorn/a
Meas. Tech.ChEMBL_963636 (CHEMBL2395155)
IC50 38±n/a nM
Citation Eckroat, TJGreen, KDReed, RABornstein, JJGarneau-Tsodikova, S Investigation of the role of linker moieties in bifunctional tacrine hybrids. Bioorg Med Chem21:3614-23 (2013) 
 
Acetylcholinesterase
Name:Acetylcholinesterase
Type:Enzyme
Mol. Mass.:71812.79
Organism:Electrophorus electricus (Electric eel)
Description:n/a
Residue:633
BDBM50435296
NameBDBM50435296
Synonyms:CHEMBL2393090
TypeSmall organic molecule
Emp. Form.C17H22ClN3
Mol. Mass.303.83
SMILESNCCCCNc1c2CCCCc2nc2cc(Cl)ccc12