Reaction Details
TargetD(2) dopamine receptor
LigandBDBM50435344
Substrate/Competitorn/a
Meas. Tech.ChEMBL_964960 (CHEMBL2395828)
Ki>10000±n/a nM
Citation Arunotayanun, WDalley, JWHuang, XPSetola, VTreble, RIversen, LRoth, BLGibbons, S An analysis of the synthetic tryptamines AMT and 5-MeO-DALT: emerging 'Novel Psychoactive Drugs'. Bioorg Med Chem Lett23:3411-5 (2013) 
 
D(2) dopamine receptor
Name:D(2) dopamine receptor
Type:Cell-surface receptors
Mol. Mass.:50647.10
Organism:Homo sapiens (Human)
Description:P14416
Residue:443
BDBM50435344
NameBDBM50435344
Synonyms:CHEMBL2391541
TypeSmall organic molecule
Emp. Form.C17H22N2O
Mol. Mass.270.3694
SMILESCOc1ccc2[nH]cc(CCN(CC=C)CC=C)c2c1