Reaction Details
TargetD(2) dopamine receptor
LigandBDBM50014210
Substrate/Competitorn/a
Meas. Tech.ChEMBL_964960 (CHEMBL2395828)
Ki>10000±n/a nM
Citation Arunotayanun, WDalley, JWHuang, XPSetola, VTreble, RIversen, LRoth, BLGibbons, S An analysis of the synthetic tryptamines AMT and 5-MeO-DALT: emerging 'Novel Psychoactive Drugs'. Bioorg Med Chem Lett23:3411-5 (2013) 
 
D(2) dopamine receptor
Name:D(2) dopamine receptor
Type:Cell-surface receptors
Mol. Mass.:50647.10
Organism:Homo sapiens (Human)
Description:P14416
Residue:443
BDBM50014210
NameBDBM50014210
Synonyms:1-(1H-Indol-3-yl)-2-propanamine 3-(2-Aminopropyl)indole DL-3-(2-Aminopropyl)indole alpha-Methyl-1H-indole-3-ethanamine alpha-Methyl-beta-indoleethylamine | alpha-methyltryptamine
TypeSmall organic molecule
Emp. Form.C11H14N2
Mol. Mass.174.2423
SMILESCC(N)Cc1c[nH]c2ccccc12