Reaction Details
TargetTyrosine-protein kinase JAK2
LigandBDBM50435520
Substrate/Competitorn/a
Meas. Tech.ChEMBL_966071 (CHEMBL2395112)
Ki 17±n/a nM
Citation Hurley, CABlair, WSBull, RJChang, CCrackett, PHDeshmukh, GDyke, HJFong, RGhilardi, NGibbons, PHewitt, PRJohnson, AJohnson, TKenny, JRKohli, PBKulagowski, JJLiimatta, MLupardus, PJMaxey, RJMendonca, RNarukulla, RPulk, RUbhayakar, Svan Abbema, AWard, SIWaszkowycz, BZak, M Novel triazolo-pyrrolopyridines as inhibitors of Janus kinase 1. Bioorg Med Chem Lett23:3592-8 (2013) 
 
Tyrosine-protein kinase JAK2
Name:Tyrosine-protein kinase JAK2
Type:Protein
Mol. Mass.:130684.68
Organism:Homo sapiens (Human)
Description:O60674
Residue:1132
BDBM50435520
NameBDBM50435520
Synonyms:CHEMBL2392484
TypeSmall organic molecule
Emp. Form.C18H24N6O
Mol. Mass.340.4228
SMILESCC(C)CC(=O)N[C@H]1CC[C@@H](CC1)n1nnc2cnc3[nH]ccc3c12