Reaction Details
TargetGlutaminyl-peptide cyclotransferase
LigandBDBM50435561
Substrate/Competitorn/a
Meas. Tech.ChEMBL_966260 (CHEMBL2395921)
IC50 185±n/a nM
Citation Tran, PTHoang, VHThorat, SAKim, SEAnn, JChang, YJNam, DWSong, HMook-Jung, ILee, JLee, J Structure-activity relationship of human glutaminyl cyclase inhibitors having an N-(5-methyl-1H-imidazol-1-yl)propyl thiourea template. Bioorg Med Chem21:3821-30 (2013) 
 
Glutaminyl-peptide cyclotransferase
Name:Glutaminyl-peptide cyclotransferase
Type:Enzyme
Mol. Mass.:40877.05
Organism:Homo sapiens (Human)
Description:Q16769
Residue:361
BDBM50435561
NameBDBM50435561
Synonyms:CHEMBL2392810
TypeSmall organic molecule
Emp. Form.C15H18N4O2S
Mol. Mass.318.394
SMILESCc1cncn1CCCNC(=S)Nc1ccc2OCOc2c1