Reaction Details
TargetGlutaminyl-peptide cyclotransferase
LigandBDBM50299853
Substrate/Competitorn/a
Meas. Tech.ChEMBL_966260 (CHEMBL2395921)
IC50 119±n/a nM
Citation Tran, PTHoang, VHThorat, SAKim, SEAnn, JChang, YJNam, DWSong, HMook-Jung, ILee, JLee, J Structure-activity relationship of human glutaminyl cyclase inhibitors having an N-(5-methyl-1H-imidazol-1-yl)propyl thiourea template. Bioorg Med Chem21:3821-30 (2013) 
 
Glutaminyl-peptide cyclotransferase
Name:Glutaminyl-peptide cyclotransferase
Type:Enzyme
Mol. Mass.:40877.05
Organism:Homo sapiens (Human)
Description:Q16769
Residue:361
BDBM50299853
NameBDBM50299853
Synonyms:1-(3,4-Dimethoxyphenyl)-3-(3-(5-methyl-1H-imidazol-1-yl)propyl)thiourea US9656991, 1
TypeSmall organic molecule
Emp. Form.C16H22N4O2S
Mol. Mass.334.436
SMILESCOc1ccc(NC(=S)NCCCn2cncc2C)cc1OC