Reaction Details
TargetC-C chemokine receptor type 1
LigandBDBM50435688
Substrate/Competitorn/a
Meas. Tech.ChEMBL_964990 (CHEMBL2396023)
IC50 1.3±n/a nM
Citation Hossain, NIvanova, SBergare, JMensonides-Harsema, MCooper, ME Design, synthesis and structure activity relationships of spirocyclic compounds as potent CCR1 antagonists. Bioorg Med Chem Lett23:3500-4 (2013) 
 
C-C chemokine receptor type 1
Name:C-C chemokine receptor type 1
Type:Enzyme
Mol. Mass.:41180.69
Organism:Homo sapiens (Human)
Description:P32246
Residue:355
BDBM50435688
NameBDBM50435688
Synonyms:CHEMBL2391797
TypeSmall organic molecule
Emp. Form.C28H36ClN3O5
Mol. Mass.530.056
SMILESCN(C)[C@@H]1CCN(C1)C(=O)c1ccc(O)cc1OC[C@@H](O)CN1CCC2(Cc3cc(Cl)ccc3O2)CC1