Reaction Details
TargetEnoyl-acyl carrier reductase ENR
LigandBDBM50435718
Substrate/Competitorn/a
Meas. Tech.ChEMBL_965386 (CHEMBL2394873)
IC50 137±n/a nM
Citation Muench, SPStec, JZhou, YAfanador, GAMcPhillie, MJHickman, MRLee, PJLeed, SEAuschwitz, JMPrigge, STRice, DWMcLeod, R Development of a triclosan scaffold which allows for adaptations on both the A- and B-ring for transport peptides. Bioorg Med Chem Lett23:3551-5 (2013) 
 
Enoyl-acyl carrier reductase ENR
Name:Enoyl-acyl carrier reductase ENR
Type:PROTEIN
Mol. Mass.:43663.67
Organism:Toxoplasma gondii
Description:ChEMBL_1290812
Residue:417
BDBM50435718
NameBDBM50435718
Synonyms:CHEMBL2392449
TypeSmall organic molecule
Emp. Form.C24H22ClN3O5
Mol. Mass.467.902
SMILESCCCc1cc(no1)-c1ccc(Oc2ccc(CNC(=O)c3cc(C)on3)cc2O)c(Cl)c1