Reaction Details
TargetAminopeptidase N
LigandBDBM50435737
Substrate/Competitorn/a
Meas. Tech.ChEMBL_965561 (CHEMBL2395658)
Ki 19±n/a nM
Citation Pathuri, GThorpe, JEDisch, BCBailey-Downs, LCIhnat, MAGali, H Solid phase synthesis and biological evaluation of probestin as an angiogenesis inhibitor. Bioorg Med Chem Lett23:3561-4 (2013) 
 
Aminopeptidase N
Name:Aminopeptidase N
Type:PROTEIN
Mol. Mass.:109522.63
Organism:Homo sapiens (Human)
Description:ChEMBL_1507526
Residue:967
BDBM50435737
NameBDBM50435737
Synonyms:PROBESTIN
TypeSmall organic molecule
Emp. Form.C26H38N4O6
Mol. Mass.502.6031
SMILESCC(C)C[C@H](NC(=O)[C@@H](O)[C@H](N)Cc1ccccc1)C(=O)N1CCC[C@H]1C(=O)N1CCC[C@H]1C(O)=O