Reaction Details
TargetN-formyl peptide receptor 3
LigandBDBM50435908
Substrate/Competitorn/a
Meas. Tech.ChEMBL_963919 (CHEMBL2393754)
EC50>50000±n/a nM
Citation Giovannoni, MPSchepetkin, IACilibrizzi, ACrocetti, LKhlebnikov, AIDahlgren, CGraziano, ADal Piaz, VKirpotina, LNZerbinati, SVergelli, CQuinn, MT Further studies on 2-arylacetamide pyridazin-3(2H)-ones: design, synthesis and evaluation of 4,6-disubstituted analogs as formyl peptide receptors (FPRs) agonists. Eur J Med Chem64:512-28 (2013) 
 
N-formyl peptide receptor 3
Name:N-formyl peptide receptor 3
Type:PROTEIN
Mol. Mass.:39971.00
Organism:Homo sapiens (Human)
Description:ChEMBL_580003
Residue:353
BDBM50435908
NameBDBM50435908
Synonyms:CHEMBL2391284
TypeSmall organic molecule
Emp. Form.C21H17BrF3N3O2
Mol. Mass.480.278
SMILESCc1cc(Cc2ccc(cc2)C(F)(F)F)c(=O)n(CC(=O)Nc2ccc(Br)cc2)n1