Reaction Details
TargetN-formyl peptide receptor 3
LigandBDBM50435935
Substrate/Competitorn/a
Meas. Tech.ChEMBL_963919 (CHEMBL2393754)
EC50>50000±n/a nM
Citation Giovannoni, MPSchepetkin, IACilibrizzi, ACrocetti, LKhlebnikov, AIDahlgren, CGraziano, ADal Piaz, VKirpotina, LNZerbinati, SVergelli, CQuinn, MT Further studies on 2-arylacetamide pyridazin-3(2H)-ones: design, synthesis and evaluation of 4,6-disubstituted analogs as formyl peptide receptors (FPRs) agonists. Eur J Med Chem64:512-28 (2013) 
 
N-formyl peptide receptor 3
Name:N-formyl peptide receptor 3
Type:PROTEIN
Mol. Mass.:39971.00
Organism:Homo sapiens (Human)
Description:ChEMBL_580003
Residue:353
BDBM50435935
NameBDBM50435935
Synonyms:CHEMBL2391257
TypeSmall organic molecule
Emp. Form.C26H28BrN3O3
Mol. Mass.510.423
SMILESCOc1cccc(Cc2cc(nn(CC(=O)Nc3ccc(Br)cc3)c2=O)C2CCCCC2)c1