Reaction Details
TargetG-protein coupled receptor 35
LigandBDBM50436015
Substrate/Competitorn/a
Meas. Tech.ChEMBL_964304 (CHEMBL2395566)
EC50 106±n/a nM
Citation Funke, MThimm, DSchiedel, ACMüller, CE 8-Benzamidochromen-4-one-2-carboxylic acids: potent and selective agonists for the orphan G protein-coupled receptor GPR35. J Med Chem56:5182-97 (2013) 
 
G-protein coupled receptor 35
Name:G-protein coupled receptor 35
Type:Enzyme Catalytic Domain
Mol. Mass.:34085.57
Organism:Homo sapiens (Human)
Description:gi_33695097
Residue:309
BDBM50436015
NameBDBM50436015
Synonyms:CHEMBL2392161
TypeSmall organic molecule
Emp. Form.C17H8Cl2FNO5
Mol. Mass.396.154
SMILESOC(=O)c1cc(=O)c2cc(F)cc(NC(=O)c3ccc(Cl)c(Cl)c3)c2o1