Reaction Details
TargetG protein-coupled receptor GPR35
LigandBDBM50436011
Substrate/Competitorn/a
Meas. Tech.ChEMBL_964307 (CHEMBL2395569)
EC50 2050±n/a nM
Citation Funke, MThimm, DSchiedel, ACMüller, CE 8-Benzamidochromen-4-one-2-carboxylic acids: potent and selective agonists for the orphan G protein-coupled receptor GPR35. J Med Chem56:5182-97 (2013) 
 
G protein-coupled receptor GPR35
Name:G protein-coupled receptor GPR35
Synonyms:GPR35
Type:PROTEIN
Mol. Mass.:34295.07
Organism:Rattus norvegicus
Description:ChEMBL_107605
Residue:306
BDBM50436011
NameBDBM50436011
Synonyms:CHEMBL2392178
TypeSmall organic molecule
Emp. Form.C18H10BrNO7
Mol. Mass.432.179
SMILESOC(=O)c1cc(=O)c2cc(Br)cc(NC(=O)c3ccc4OCOc4c3)c2o1