Reaction Details
TargetG protein-coupled receptor GPR35
LigandBDBM50436015
Substrate/Competitorn/a
Meas. Tech.ChEMBL_964307 (CHEMBL2395569)
EC50 2650±n/a nM
Citation Funke, MThimm, DSchiedel, ACMüller, CE 8-Benzamidochromen-4-one-2-carboxylic acids: potent and selective agonists for the orphan G protein-coupled receptor GPR35. J Med Chem56:5182-97 (2013) 
 
G protein-coupled receptor GPR35
Name:G protein-coupled receptor GPR35
Synonyms:GPR35
Type:PROTEIN
Mol. Mass.:34295.07
Organism:Rattus norvegicus
Description:ChEMBL_107605
Residue:306
BDBM50436015
NameBDBM50436015
Synonyms:CHEMBL2392161
TypeSmall organic molecule
Emp. Form.C17H8Cl2FNO5
Mol. Mass.396.154
SMILESOC(=O)c1cc(=O)c2cc(F)cc(NC(=O)c3ccc(Cl)c(Cl)c3)c2o1