Reaction Details
TargetG-protein coupled receptor 35
LigandBDBM50436002
Substrate/Competitorn/a
Meas. Tech.ChEMBL_964310 (CHEMBL2395572)
EC50 2990±n/a nM
Citation Funke, MThimm, DSchiedel, ACMüller, CE 8-Benzamidochromen-4-one-2-carboxylic acids: potent and selective agonists for the orphan G protein-coupled receptor GPR35. J Med Chem56:5182-97 (2013) 
 
G-protein coupled receptor 35
Name:G-protein coupled receptor 35
Type:PROTEIN
Mol. Mass.:34163.11
Organism:Mus musculus
Description:ChEMBL_107606
Residue:307
BDBM50436002
NameBDBM50436002
Synonyms:CHEMBL2392151
TypeSmall organic molecule
Emp. Form.C21H13NO5
Mol. Mass.359.3316
SMILESOC(=O)c1cc(=O)c2cccc(NC(=O)c3ccc4ccccc4c3)c2o1