Reaction Details
TargetG-protein coupled receptor 35
LigandBDBM50436022
Substrate/Competitorn/a
Meas. Tech.ChEMBL_964313 (CHEMBL2395575)
EC50 1710±n/a nM
Citation Funke, MThimm, DSchiedel, ACMüller, CE 8-Benzamidochromen-4-one-2-carboxylic acids: potent and selective agonists for the orphan G protein-coupled receptor GPR35. J Med Chem56:5182-97 (2013) 
 
G-protein coupled receptor 35
Name:G-protein coupled receptor 35
Type:Enzyme Catalytic Domain
Mol. Mass.:34085.57
Organism:Homo sapiens (Human)
Description:gi_33695097
Residue:309
BDBM50436022
NameBDBM50436022
Synonyms:CHEMBL2392166
TypeSmall organic molecule
Emp. Form.C17H9ClN2O7
Mol. Mass.388.716
SMILESOC(=O)c1cc(=O)c2cc(Cl)cc(NC(=O)c3ccc(cc3)[N+]([O-])=O)c2o1