Reaction Details
TargetG-protein coupled receptor 35
LigandBDBM50436031
Substrate/Competitorn/a
Meas. Tech.ChEMBL_964313 (CHEMBL2395575)
EC50 1380±n/a nM
Citation Funke, MThimm, DSchiedel, ACMüller, CE 8-Benzamidochromen-4-one-2-carboxylic acids: potent and selective agonists for the orphan G protein-coupled receptor GPR35. J Med Chem56:5182-97 (2013) 
 
G-protein coupled receptor 35
Name:G-protein coupled receptor 35
Type:Enzyme Catalytic Domain
Mol. Mass.:34085.57
Organism:Homo sapiens (Human)
Description:gi_33695097
Residue:309
BDBM50436031
NameBDBM50436031
Synonyms:CHEMBL2392155
TypeSmall organic molecule
Emp. Form.C18H13NO5
Mol. Mass.323.2995
SMILESCc1ccc(cc1)C(=O)Nc1cccc2c1oc(cc2=O)C(O)=O