Reaction Details
TargetG-protein coupled receptor 35
LigandBDBM50436033
Substrate/Competitorn/a
Meas. Tech.ChEMBL_964313 (CHEMBL2395575)
EC50 8960±n/a nM
Citation Funke, MThimm, DSchiedel, ACMüller, CE 8-Benzamidochromen-4-one-2-carboxylic acids: potent and selective agonists for the orphan G protein-coupled receptor GPR35. J Med Chem56:5182-97 (2013) 
 
G-protein coupled receptor 35
Name:G-protein coupled receptor 35
Type:Enzyme Catalytic Domain
Mol. Mass.:34085.57
Organism:Homo sapiens (Human)
Description:gi_33695097
Residue:309
BDBM50436033
NameBDBM50436033
Synonyms:CHEMBL2392150
TypeSmall organic molecule
Emp. Form.C18H13NO5
Mol. Mass.323.2995
SMILESOC(=O)c1cc(=O)c2cccc(NC(=O)Cc3ccccc3)c2o1