Reaction Details
TargetG-protein coupled receptor 35
LigandBDBM50436034
Substrate/Competitorn/a
Meas. Tech.ChEMBL_964313 (CHEMBL2395575)
EC50 4910±n/a nM
Citation Funke, MThimm, DSchiedel, ACMüller, CE 8-Benzamidochromen-4-one-2-carboxylic acids: potent and selective agonists for the orphan G protein-coupled receptor GPR35. J Med Chem56:5182-97 (2013) 
 
G-protein coupled receptor 35
Name:G-protein coupled receptor 35
Type:Enzyme Catalytic Domain
Mol. Mass.:34085.57
Organism:Homo sapiens (Human)
Description:gi_33695097
Residue:309
BDBM50436034
NameBDBM50436034
Synonyms:CHEMBL2392149
TypeSmall organic molecule
Emp. Form.C17H11NO5
Mol. Mass.309.2729
SMILESOC(=O)c1cc(=O)c2cccc(NC(=O)c3ccccc3)c2o1