Reaction Details
TargetG-protein coupled receptor 35
LigandBDBM38549
Substrate/Competitorn/a
Meas. Tech.ChEMBL_964313 (CHEMBL2395575)
EC50 50±n/a nM
Citation Funke, MThimm, DSchiedel, ACMüller, CE 8-Benzamidochromen-4-one-2-carboxylic acids: potent and selective agonists for the orphan G protein-coupled receptor GPR35. J Med Chem56:5182-97 (2013) 
 
G-protein coupled receptor 35
Name:G-protein coupled receptor 35
Type:Enzyme Catalytic Domain
Mol. Mass.:34085.57
Organism:Homo sapiens (Human)
Description:gi_33695097
Residue:309
BDBM38549
NameBDBM38549
Synonyms:2-[2-[4-[(4-chlorophenyl)-phenyl-methyl]piperazino]ethoxy]ethanol 4-[(3-carboxy-2-hydroxy-1-naphthalenyl)methyl]-3-hydroxy-2-naphthalenecarboxylic acid CHEMBL170358 HYDROXYZINE PAMOATE Pamoic acid US11744839, Compound of formula 8 | cid_25096
TypeSmall organic molecule
Emp. Form.C23H16O6
Mol. Mass.388.3695
SMILESOC(=O)c1cc2ccccc2c(Cc2c(O)c(cc3ccccc23)C(O)=O)c1O