Reaction Details
TargetLysine-specific demethylase 2A
LigandBDBM50436040
Substrate/Competitorn/a
Meas. Tech.ChEMBL_964320 (CHEMBL2395582)
Ki 1980±n/a nM
Citation Xu, WPodoll, JDDong, XTumber, AOppermann, UWang, X Quantitative analysis of histone demethylase probes using fluorescence polarization. J Med Chem56:5198-202 (2013) 
 
Lysine-specific demethylase 2A
Name:Lysine-specific demethylase 2A
Type:Enzyme Catalytic Domain
Mol. Mass.:132809.04
Organism:Homo sapiens (Human)
Description:n/a
Residue:1162
BDBM50436040
NameBDBM50436040
Synonyms:CHEMBL2392184
TypeSmall organic molecule
Emp. Form.C37H32N4O9S
Mol. Mass.708.737
SMILESNCc1ccc(CN(CCCCN(O)C(=O)C=CC([O-])=O)C(=S)Nc2ccc(c(c2)C([O-])=O)-c2c3ccc(O)cc3oc3cc(=O)ccc23)cc1