Reaction Details
TargetBifunctional epoxide hydrolase 2
LigandBDBM50217448
Substrate/Competitorn/a
Meas. Tech.ChEMBL_968438 (CHEMBL2400589)
Ki 1.5±n/a nM
Citation Morisseau, CPakhomova, SHwang, SHNewcomer, MEHammock, BD Inhibition of soluble epoxide hydrolase by fulvestrant and sulfoxides. Bioorg Med Chem Lett23:3818-21 (2013) 
 
Bifunctional epoxide hydrolase 2
Name:Bifunctional epoxide hydrolase 2
Type:Enzyme
Mol. Mass.:62613.07
Organism:Homo sapiens (Human)
Description:P34913
Residue:555
BDBM50217448
NameBDBM50217448
Synonyms:CHEMBL242459 trans-4-[4-(3-adamantan-1-ylureido)cyclohexyloxy]benzoic acid
TypeSmall organic molecule
Emp. Form.C24H32N2O4
Mol. Mass.412.5219
SMILESOC(=O)c1ccc(O[C@H]2CC[C@@H](CC2)NC(=O)NC23CC4CC(CC(C4)C2)C3)cc1