Reaction Details
TargetVoltage-dependent L-type calcium channel subunit alpha-1C
LigandBDBM50436176
Substrate/Competitorn/a
Meas. Tech.ChEMBL_967638 (CHEMBL2399368)
IC50 107±n/a nM
Citation Kang, SCooper, GDunne, SFLuan, CHJames Surmeier, DSilverman, RB Antagonism of L-type Ca2+ channels CaV1.3 and CaV1.2 by 1,4-dihydropyrimidines and 4H-pyrans as dihydropyridine mimics. Bioorg Med Chem21:4365-73 (2013) 
 
Voltage-dependent L-type calcium channel subunit alpha-1C
Name:Voltage-dependent L-type calcium channel subunit alpha-1C
Type:PROTEIN
Mol. Mass.:242793.78
Organism:Oryctolagus cuniculus
Description:ChEMBL_42776
Residue:2171
BDBM50436176
NameBDBM50436176
Synonyms:Dynacirc ISRADIPINE PN-200-110
TypeSmall organic molecule
Emp. Form.C19H21N3O5
Mol. Mass.371.3871
SMILESCOC(=O)C1=C(C)NC(C)=C(C1c1cccc2nonc12)C(=O)OC(C)C