Reaction Details
TargetBile acid receptor
LigandBDBM50054245
Substrate/Competitorn/a
Meas. Tech.ChEMBL_967650 (CHEMBL2399380)
IC50 2770±n/a nM
Citation Yu, DDLin, WChen, TForman, BM Development of time resolved fluorescence resonance energy transfer-based assay for FXR antagonist discovery. Bioorg Med Chem21:4266-78 (2013) 
 
Bile acid receptor
Name:Bile acid receptor
Type:Nuclear Receptor
Mol. Mass.:55916.24
Organism:Homo sapiens (Human)
Description:Q96RI1
Residue:486
BDBM50054245
NameBDBM50054245
Synonyms:5-Chloro-N-cyclopropylmethyl-2-methyl-N-propyl-N''-(2,4,6-trichloro-phenyl)-pyrimidine-4,6-diamine CHEMBL45281 | cid_176157
TypeSmall organic molecule
Emp. Form.C18H20Cl4N4
Mol. Mass.434.19
SMILESCCCN(CC1CC1)c1nc(C)nc(Nc2c(Cl)cc(Cl)cc2Cl)c1Cl