Reaction Details
TargetSubstance-P receptor
LigandBDBM50436553
Substrate/Competitorn/a
Meas. Tech.ChEMBL_966838 (CHEMBL2400839)
Ki 2.2±n/a nM
Citation Fransson, RSköld, CKratz, JMSvensson, RArtursson, PNyberg, FHallberg, MSandström, A Constrained H-Phe-Phe-NH2 analogues with high affinity to the substance P 1-7 binding site and with improved metabolic stability and cell permeability. J Med Chem56:4953-65 (2013) 
 
Substance-P receptor
Name:Substance-P receptor
Type:G Protein-Coupled Receptor (GPCR)
Mol. Mass.:46371.54
Organism:Rattus norvegicus (rat)
Description:Competition binding assays were carried out using membrane preparations from transfected CHO cells that constitutively expressed the rat NK1 receptor.
Residue:407
BDBM50436553
NameBDBM50436553
Synonyms:CHEMBL2396664
TypeSmall organic molecule
Emp. Form.C20H23N3O2
Mol. Mass.337.4155
SMILESN[C@@H](Cc1ccccc1)C(=O)N1CC[C@H]([C@H]1C(N)=O)c1ccccc1