Reaction Details
TargetSubstance-P receptor
LigandBDBM50436558
Substrate/Competitorn/a
Meas. Tech.ChEMBL_966838 (CHEMBL2400839)
Ki 9.4±n/a nM
Citation Fransson, RSköld, CKratz, JMSvensson, RArtursson, PNyberg, FHallberg, MSandström, A Constrained H-Phe-Phe-NH2 analogues with high affinity to the substance P 1-7 binding site and with improved metabolic stability and cell permeability. J Med Chem56:4953-65 (2013) 
 
Substance-P receptor
Name:Substance-P receptor
Type:G Protein-Coupled Receptor (GPCR)
Mol. Mass.:46371.54
Organism:Rattus norvegicus (rat)
Description:Competition binding assays were carried out using membrane preparations from transfected CHO cells that constitutively expressed the rat NK1 receptor.
Residue:407
BDBM50436558
NameBDBM50436558
Synonyms:CHEMBL2397484
TypeSmall organic molecule
Emp. Form.C19H23N3O2
Mol. Mass.325.4048
SMILESCN([C@@H](Cc1ccccc1)C(N)=O)C(=O)[C@@H](N)Cc1ccccc1