Reaction Details
TargetSerine/threonine-protein kinase pim-3
LigandBDBM50436563
Substrate/Competitorn/a
Meas. Tech.ChEMBL_966955 (CHEMBL2401340)
IC50 110±n/a nM
Citation Suchaud, VGavara, LSaugues, ENauton, LThéry, VAnizon, FMoreau, P Identification of 1,6-dihydropyrazolo[4,3-c]carbazoles and 3,6-dihydropyrazolo[3,4-c]carbazoles as new Pim kinase inhibitors. Bioorg Med Chem21:4102-11 (2013) 
 
Serine/threonine-protein kinase pim-3
Name:Serine/threonine-protein kinase pim-3
Type:Protein
Mol. Mass.:35888.19
Organism:Homo sapiens (Human)
Description:Q86V86
Residue:326
BDBM50436563
NameBDBM50436563
Synonyms:CHEMBL2397524
TypeSmall organic molecule
Emp. Form.C14H10N4O3
Mol. Mass.282.2542
SMILESCOc1ccc2[nH]c3c(cc4n[nH]cc4c3c2c1)[N+]([O-])=O