Reaction Details
TargetEnoyl-[acyl-carrier-protein] reductase [NADH]
LigandBDBM50436715
Substrate/Competitorn/a
Meas. Tech.ChEMBL_966863 (CHEMBL2401007)
Ki 3400±n/a nM
Citation Hu, XCompton, JRAbdulhameed, MDMarchand, CLRobertson, KLLeary, DHJadhav, AHershfield, JRWallqvist, AFriedlander, AMLegler, PM 3-substituted indole inhibitors against Francisella tularensis FabI identified by structure-based virtual screening. J Med Chem56:5275-87 (2014) 
 
Enoyl-[acyl-carrier-protein] reductase [NADH]
Name:Enoyl-[acyl-carrier-protein] reductase [NADH]
Synonyms:fabI
Type:PROTEIN
Mol. Mass.:27804.42
Organism:Francisella tularensis subsp. tularensis (strain SCHU S4 / Schu 4)
Description:Q5NGQ3
Residue:260
BDBM50436715
NameBDBM50436715
Synonyms:CHEMBL2398661
TypeSmall organic molecule
Emp. Form.C18H18N2O2S
Mol. Mass.326.413
SMILESO=C(COc1ccccc1)NCCSc1c[nH]c2ccccc12