Reaction Details
TargetAcetylcholinesterase
LigandBDBM50436827
Substrate/Competitorn/a
Meas. Tech.ChEMBL_970665 (CHEMBL2405882)
IC50 3860±n/a nM
Citation Sivakumar, SRanjith Kumar, RAli, MAChoon, TS An atom economic synthesis and AChE inhibitory activity of novel dispiro 7-aryltetrahydro-1H-pyrrolo[1,2-c][1,3]thiazole and 4-aryloctahydroindolizine N-methylpiperidin-4-one hybrid heterocycles. Eur J Med Chem65:240-8 (2013) 
 
Acetylcholinesterase
Name:Acetylcholinesterase
Type:Enzyme
Mol. Mass.:71812.79
Organism:Electrophorus electricus (Electric eel)
Description:n/a
Residue:633
BDBM50436827
NameBDBM50436827
Synonyms:CHEMBL3038161
TypeSmall organic molecule
Emp. Form.C39H38N2O2
Mol. Mass.566.7312
SMILESCN1C\C(=C/c2ccccc2C)C(=O)[C@]2(C1)[C@H]([C@@H]1CCCCN1[C@@]21C(=O)c2cccc3cccc1c23)c1ccccc1C