Reaction Details
TargetP2Y purinoceptor 1
LigandBDBM50436907
Substrate/Competitorn/a
Meas. Tech.ChEMBL_972128 (CHEMBL2406600)
Ki 8.0±n/a nM
Citation Hossain, NIvanova, STimén, ÅSBergare, JMussie, TBergström, L Design, synthesis and structure-activity relationships of zwitterionic spirocyclic compounds as potent CCR1 antagonists. Bioorg Med Chem Lett23:4026-30 (2013) 
 
P2Y purinoceptor 1
Name:P2Y purinoceptor 1
Type:Enzyme
Mol. Mass.:42090.25
Organism:Homo sapiens (Human)
Description:P47900
Residue:373
BDBM50436907
NameBDBM50436907
Synonyms:CHEMBL2401856
TypeSmall organic molecule
Emp. Form.C26H24F3N3OS
Mol. Mass.483.548
SMILESCc1ccc(cc1)-c1sc(Nc2cccnc2Oc2ccccc2C(C)(C)C)nc1C(F)(F)F