Reaction Details
TargetCyclin-T1/Cyclin-dependent kinase 9
LigandBDBM50437236
Substrate/Competitorn/a
Meas. Tech.ChEMBL_969557 (CHEMBL2406221)
IC50 11±n/a nM
Citation Gucký, TJorda, RZatloukal, MBazgier, VBerka, KReznícková, EBéres, TStrnad, MKryštof, V A novel series of highly potent 2,6,9-trisubstituted purine cyclin-dependent kinase inhibitors. J Med Chem56:6234-47 (2013) 
 
Cyclin-T1/Cyclin-dependent kinase 9
Name:Cyclin-T1/Cyclin-dependent kinase 9
Type:Protein Complex
Mol. Mass.:n/a
Description:n/a
Components:This complex has 2 components.
Component 1
Name:Cyclin-T1
Synonyms:CCNT1 CycT Cyclin T Cyclin-T
Type:Enzyme Subunit
Mol. Mass.:80712.40
Organism:Homo sapiens (Human)
Description:n/a
Residue:726
Component 2
Name:Cyclin-dependent kinase 9
Synonyms:C-2K CDK9 Cell division cycle 2-like protein kinase 4 Cyclin-Dependent Kinase 9 (CDK9) Serine/threonine-protein kinase PITALRE Tat-associated kinase complex catalytic subunit
Type:Enzyme Subunit
Mol. Mass.:42789.13
Organism:Homo sapiens (Human)
Description:n/a
Residue:372
BDBM50437236
NameBDBM50437236
Synonyms:CHEMBL2402946
TypeSmall organic molecule
Emp. Form.C28H34N8O
Mol. Mass.498.6226
SMILESNC1CCC(CC1)Nc1nc(NCc2ccc(nc2)-c2ccccc2O)c2ncn(C3CCCC3)c2n1