Reaction Details
TargetHexokinase-4
LigandBDBM50165031
Substrate/Competitorn/a
Meas. Tech.ChEMBL_972469 (CHEMBL2412839)
Kd 170±n/a nM
Citation Bowler, JMHervert, KLKearley, MLMiller, BG Small-Molecule Allosteric Activation of Human Glucokinase in the Absence of Glucose. ACS Med Chem Lett4:580-4 (2013) 
 
Hexokinase-4
Name:Hexokinase-4
Type:Enzyme
Mol. Mass.:52175.81
Organism:Homo sapiens (Human)
Description:P35557
Residue:465
BDBM50165031
NameBDBM50165031
Synonyms:6-({3-isopropoxy-5-[2-(3-thienyl)ethoxy]benzoyl}amino)nicotinic acid CHEMBL373339
TypeSmall organic molecule
Emp. Form.C22H22N2O5S
Mol. Mass.426.485
SMILESCC(C)Oc1cc(OCCc2ccsc2)cc(c1)C(=O)Nc1ccc(cn1)C(O)=O