Reaction Details
TargetProto-oncogene tyrosine-protein kinase Src
LigandBDBM50005014
Substrate/Competitorn/a
Meas. Tech.ChEMBL_972664 (CHEMBL2410767)
Ki 4300±n/a nM
Citation Ko, KSSteffey, MEBrandvold, KRSoellner, MB Development of a chimeric c-Src kinase and HDAC inhibitor. ACS Med Chem Lett4:779-783 (2013) 
 
Proto-oncogene tyrosine-protein kinase Src
Name:Proto-oncogene tyrosine-protein kinase Src
Type:Protein
Mol. Mass.:59838.60
Organism:Homo sapiens (Human)
Description:P12931
Residue:536
BDBM50005014
NameBDBM50005014
Synonyms:CHEMBL2408781
TypeSmall organic molecule
Emp. Form.C29H22ClN9O2
Mol. Mass.563.997
SMILESNc1ncnc2n(nc(-c3ccc(Cl)cc3)c12)-c1cccc(c1)-c1cnnn1Cc1ccc(\C=C\C(=O)NO)cc1