Reaction Details
TargetProto-oncogene tyrosine-protein kinase Src
LigandBDBM50005013
Substrate/Competitorn/a
Meas. Tech.ChEMBL_972664 (CHEMBL2410767)
Ki 190±n/a nM
Citation Ko, KSSteffey, MEBrandvold, KRSoellner, MB Development of a chimeric c-Src kinase and HDAC inhibitor. ACS Med Chem Lett4:779-783 (2013) 
 
Proto-oncogene tyrosine-protein kinase Src
Name:Proto-oncogene tyrosine-protein kinase Src
Type:Protein
Mol. Mass.:59838.60
Organism:Homo sapiens (Human)
Description:P12931
Residue:536
BDBM50005013
NameBDBM50005013
Synonyms:CHEMBL2408779
TypeSmall organic molecule
Emp. Form.C26H26ClN9O2
Mol. Mass.531.997
SMILESNc1ncnc2n(nc(-c3ccc(Cl)cc3)c12)-c1cccc(c1)-c1cnnn1CCCCCCC(=O)NO