Reaction Details
TargetProto-oncogene tyrosine-protein kinase Src
LigandBDBM50005018
Substrate/Competitorn/a
Meas. Tech.ChEMBL_972667 (CHEMBL2410770)
Ki>12500000±n/a nM
Citation Ko, KSSteffey, MEBrandvold, KRSoellner, MB Development of a chimeric c-Src kinase and HDAC inhibitor. ACS Med Chem Lett4:779-783 (2013) 
 
Proto-oncogene tyrosine-protein kinase Src
Name:Proto-oncogene tyrosine-protein kinase Src
Type:Protein
Mol. Mass.:59838.60
Organism:Homo sapiens (Human)
Description:P12931
Residue:536
BDBM50005018
NameBDBM50005018
Synonyms:CHEMBL2407108
TypeSmall organic molecule
Emp. Form.C14H18N4O2
Mol. Mass.274.3183
SMILESONC(=O)CCCCCn1nncc1-c1ccccc1