Reaction Details
TargetProto-oncogene tyrosine-protein kinase Src
LigandBDBM50005017
Substrate/Competitorn/a
Meas. Tech.ChEMBL_972667 (CHEMBL2410770)
Ki 605±n/a nM
Citation Ko, KSSteffey, MEBrandvold, KRSoellner, MB Development of a chimeric c-Src kinase and HDAC inhibitor. ACS Med Chem Lett4:779-783 (2013) 
 
Proto-oncogene tyrosine-protein kinase Src
Name:Proto-oncogene tyrosine-protein kinase Src
Type:Protein
Mol. Mass.:59838.60
Organism:Homo sapiens (Human)
Description:P12931
Residue:536
BDBM50005017
NameBDBM50005017
Synonyms:CHEMBL2408783
TypeSmall organic molecule
Emp. Form.C17H12ClN5
Mol. Mass.321.764
SMILESNc1ncnc2n(nc(-c3ccc(Cl)cc3)c12)-c1ccccc1