Reaction Details
TargetHistone deacetylase 1
LigandBDBM50005013
Substrate/Competitorn/a
Meas. Tech.ChEMBL_972663 (CHEMBL2410766)
Ki 0.82±n/a nM
Citation Ko, KSSteffey, MEBrandvold, KRSoellner, MB Development of a chimeric c-Src kinase and HDAC inhibitor. ACS Med Chem Lett4:779-783 (2013) 
 
Histone deacetylase 1
Name:Histone deacetylase 1
Type:Enzyme
Mol. Mass.:55090.27
Organism:Homo sapiens (Human)
Description:Q13547
Residue:482
BDBM50005013
NameBDBM50005013
Synonyms:CHEMBL2408779
TypeSmall organic molecule
Emp. Form.C26H26ClN9O2
Mol. Mass.531.997
SMILESNc1ncnc2n(nc(-c3ccc(Cl)cc3)c12)-c1cccc(c1)-c1cnnn1CCCCCCC(=O)NO