Reaction Details
TargetHistone deacetylase 1
LigandBDBM50005018
Substrate/Competitorn/a
Meas. Tech.ChEMBL_972666 (CHEMBL2410769)
Ki 45±n/a nM
Citation Ko, KSSteffey, MEBrandvold, KRSoellner, MB Development of a chimeric c-Src kinase and HDAC inhibitor. ACS Med Chem Lett4:779-783 (2013) 
 
Histone deacetylase 1
Name:Histone deacetylase 1
Type:Enzyme
Mol. Mass.:55090.27
Organism:Homo sapiens (Human)
Description:Q13547
Residue:482
BDBM50005018
NameBDBM50005018
Synonyms:CHEMBL2407108
TypeSmall organic molecule
Emp. Form.C14H18N4O2
Mol. Mass.274.3183
SMILESONC(=O)CCCCCn1nncc1-c1ccccc1