Reaction Details
TargetHistone deacetylase 1
LigandBDBM50005017
Substrate/Competitorn/a
Meas. Tech.ChEMBL_972666 (CHEMBL2410769)
Ki>12500000±n/a nM
Citation Ko, KSSteffey, MEBrandvold, KRSoellner, MB Development of a chimeric c-Src kinase and HDAC inhibitor. ACS Med Chem Lett4:779-783 (2013) 
 
Histone deacetylase 1
Name:Histone deacetylase 1
Type:Enzyme
Mol. Mass.:55090.27
Organism:Homo sapiens (Human)
Description:Q13547
Residue:482
BDBM50005017
NameBDBM50005017
Synonyms:CHEMBL2408783
TypeSmall organic molecule
Emp. Form.C17H12ClN5
Mol. Mass.321.764
SMILESNc1ncnc2n(nc(-c3ccc(Cl)cc3)c12)-c1ccccc1