Reaction Details
TargetHistone deacetylase 3
LigandBDBM50437405
Substrate/Competitorn/a
Meas. Tech.ChEMBL_972660 (CHEMBL2410763)
IC50 19±n/a nM
Citation Ko, KSSteffey, MEBrandvold, KRSoellner, MB Development of a chimeric c-Src kinase and HDAC inhibitor. ACS Med Chem Lett4:779-783 (2013) 
 
Histone deacetylase 3
Name:Histone deacetylase 3
Type:Enzyme
Mol. Mass.:48829.55
Organism:Homo sapiens (Human)
Description:O15379
Residue:428
BDBM50437405
NameBDBM50437405
Synonyms:CHEMBL2408778
TypeSmall organic molecule
Emp. Form.C25H24ClN9O2
Mol. Mass.517.97
SMILESNc1ncnc2n(nc(-c3ccc(Cl)cc3)c12)-c1cccc(c1)-c1cnnn1CCCCCC(=O)NO