Reaction Details
TargetSerine/threonine-protein kinase ATR
LigandBDBM50437437
Substrate/Competitorn/a
Meas. Tech.ChEMBL_974436 (CHEMBL2412508)
Ki 16±n/a nM
Citation Abdel-Magid, AF Inhibitors of ATR Kinase for Treatment of Cancer. ACS Med Chem Lett4:688-9 (2013) 
 
Serine/threonine-protein kinase ATR
Name:Serine/threonine-protein kinase ATR
Type:Protein
Mol. Mass.:301404.58
Organism:Homo sapiens (Human)
Description:Q13535
Residue:2644
BDBM50437437
NameBDBM50437437
Synonyms:CHEMBL2409217 | US8841450, I-2
TypeSmall organic molecule
Emp. Form.C24H27N5O3S
Mol. Mass.465.568
SMILESCNCc1ccc(cc1)C1=NOC(C1)c1nc(cnc1N)-c1ccc(cc1)S(=O)(=O)C(C)C