Reaction Details
TargetAldo-keto reductase family 1 member B1 [K65Q]
LigandBDBM50437454
Substrate/Competitorn/a
Meas. Tech.ChEMBL_974577 (CHEMBL2410165)
IC50 1810±n/a nM
Citation Wang, QQCheng, NZheng, XWPeng, SMZou, XQ Synthesis of organic nitrates of luteolin as a novel class of potent aldose reductase inhibitors. Bioorg Med Chem21:4301-10 (2013) 
 
Aldo-keto reductase family 1 member B1 [K65Q]
Name:Aldo-keto reductase family 1 member B1 [K65Q]
Type:Protein
Mol. Mass.:35916.27
Organism:Bos taurus (Cattle)
Description:P16116[K65Q]
Residue:315
BDBM50437454
NameBDBM50437454
Synonyms:CHEMBL2409470
TypeSmall organic molecule
Emp. Form.C21H22O6
Mol. Mass.370.3958
SMILESCCCCCCOc1cc(O)c2c(c1)oc(cc2=O)-c1ccc(O)c(O)c1