Reaction Details
TargetAldo-keto reductase family 1 member B1 [K65Q]
LigandBDBM50437463
Substrate/Competitorn/a
Meas. Tech.ChEMBL_974577 (CHEMBL2410165)
IC50 491±n/a nM
Citation Wang, QQCheng, NZheng, XWPeng, SMZou, XQ Synthesis of organic nitrates of luteolin as a novel class of potent aldose reductase inhibitors. Bioorg Med Chem21:4301-10 (2013) 
 
Aldo-keto reductase family 1 member B1 [K65Q]
Name:Aldo-keto reductase family 1 member B1 [K65Q]
Type:Protein
Mol. Mass.:35916.27
Organism:Bos taurus (Cattle)
Description:P16116[K65Q]
Residue:315
BDBM50437463
NameBDBM50437463
Synonyms:CHEMBL2409469
TypeSmall organic molecule
Emp. Form.C21H21NO9
Mol. Mass.431.3927
SMILESOc1ccc(cc1O)-c1cc([O-])c2c(cc(OCCCCCCO[N+]([O-])=O)cc2=[OH+])o1