Reaction Details
TargetAldo-keto reductase family 1 member B1 [K65Q]
LigandBDBM50437465
Substrate/Competitorn/a
Meas. Tech.ChEMBL_974577 (CHEMBL2410165)
IC50 472±n/a nM
Citation Wang, QQCheng, NZheng, XWPeng, SMZou, XQ Synthesis of organic nitrates of luteolin as a novel class of potent aldose reductase inhibitors. Bioorg Med Chem21:4301-10 (2013) 
 
Aldo-keto reductase family 1 member B1 [K65Q]
Name:Aldo-keto reductase family 1 member B1 [K65Q]
Type:Protein
Mol. Mass.:35916.27
Organism:Bos taurus (Cattle)
Description:P16116[K65Q]
Residue:315
BDBM50437465
NameBDBM50437465
Synonyms:CHEMBL2409467
TypeSmall organic molecule
Emp. Form.C19H17NO9
Mol. Mass.403.3396
SMILESOc1ccc(cc1O)-c1cc([O-])c2c(cc(OCCCCO[N+]([O-])=O)cc2=[OH+])o1