Reaction Details
TargetPlatelet-derived growth factor receptor beta
LigandBDBM50437561
Substrate/Competitorn/a
Meas. Tech.ChEMBL_974190 (CHEMBL2411324)
IC50>100000±n/a nM
Citation Wang, XChen, ZTong, LTan, SZhou, WPeng, THan, KDing, JXie, HXu, Y Naphthalimides exhibit in vitro antiproliferative and antiangiogenic activities by inhibiting both topoisomerase II (topo II) and receptor tyrosine kinases (RTKs). Eur J Med Chem65:477-86 (2013) 
 
Platelet-derived growth factor receptor beta
Name:Platelet-derived growth factor receptor beta
Type:Enzyme
Mol. Mass.:123922.25
Organism:Homo sapiens (Human)
Description:P09619
Residue:1106
BDBM50437561
NameBDBM50437561
Synonyms:CHEMBL2407518
TypeSmall organic molecule
Emp. Form.C22H30N4O2
Mol. Mass.382.4992
SMILESCCCCN1C(=O)c2cccc3c(NCCNCCN(C)C)ccc(C1=O)c23