Reaction Details
TargetPeptidyl-prolyl cis-trans isomerase NIMA-interacting 1
LigandBDBM34012
Substrate/Competitorn/a
Meas. Tech.ChEMBL_974636 (CHEMBL2410562)
IC50 6.0±n/a nM
Citation Moore, JDPotter, A Pin1 inhibitors: Pitfalls, progress and cellular pharmacology. Bioorg Med Chem Lett23:4283-91 (2013) 
 
Peptidyl-prolyl cis-trans isomerase NIMA-interacting 1
Name:Peptidyl-prolyl cis-trans isomerase NIMA-interacting 1
Type:PROTEIN
Mol. Mass.:18248.11
Organism:Homo sapiens (Human)
Description:ChEMBL_1502595
Residue:163
BDBM34012
NameBDBM34012
Synonyms:3-fluorophenylalanine derivative, 21b
TypeSmall organic molecule
Emp. Form.C18H17FNO5PS
Mol. Mass.409.368
SMILESOP(O)(=O)OC[C@@H](Cc1cccc(F)c1)NC(=O)c1cc2ccccc2s1