Reaction Details
TargetVesicular acetylcholine transporter
LigandBDBM50437721
Substrate/Competitorn/a
Meas. Tech.ChEMBL_973123 (CHEMBL2412886)
Ki 3.0±n/a nM
Citation Li, JZhang, XZhang, ZPadakanti, PKJin, HCui, JLi, AZeng, DRath, NPFlores, HPerlmutter, JSParsons, SMTu, Z Heteroaromatic and aniline derivatives of piperidines as potent ligands for vesicular acetylcholine transporter. J Med Chem56:6216-33 (2013) 
 
Vesicular acetylcholine transporter
Name:Vesicular acetylcholine transporter
Type:PROTEIN
Mol. Mass.:56900.67
Organism:Homo sapiens (Human)
Description:ChEMBL_1507628
Residue:532
BDBM50437721
NameBDBM50437721
Synonyms:CHEMBL2409374
TypeSmall organic molecule
Emp. Form.C23H28N2O2
Mol. Mass.364.4806
SMILESCNc1ccc(cc1)C(=O)C1CCN(CC1)[C@@H]1Cc2ccccc2C[C@H]1O